{"text_format":"1","workbook":"xlsx","n_sheets":11,"sheets":["BoE Template Instructions ","Rate Table","BoE Summary","BoE Capital Cost Detail","BoE Operating Cost Detail","Class of Estimate Instructions","Class of Estimate","Data","Rationale","Master Data","MD OLD"],"not_rendered":{"charts":0,"images":6,"macros":1,"external_links":1,"defined_names":8,"comments":0,"pivot_tables":0},"unopened":[],"bounds":{"document_bytes":16777216,"sheet_cells":100000,"rows_first":2000,"rows_last":500,"rows_between":2000,"halvings":0,"cell_chars":16384,"cell_head_chars":4096},"cells_cut":0,"cells_raw":0,"read":"whole","date_system":"1900"}

{"sheet":"BoE Template Instructions ","index":0,"n_rows":56,"n_cols":2,"rows_kept":56,"cut":false,"hidden":false,"merged":[[31,0,31,1],[33,0,33,1],[32,0,32,1],[49,0,49,1],[50,0,50,1],[48,0,48,1],[30,0,30,1],[0,0,0,1],[10,0,10,1],[29,0,29,1],[2,0,2,1],[1,0,1,1],[3,0,3,1],[4,0,4,1],[5,0,5,1],[7,0,7,1],[6,0,6,1],[8,0,8,1]]}
["Basis of Estimate (BoE) Template Instructions"]
["This template identifies the key elements that formulate the Cost Estimate for an investment. This is a standardized template to be used across the City to identify the entire cost of an investment.  The Basis of Estimate (BoE) is the foundation for the budget request outlined in the Business Case (BC).\n\nThe BoE is a companion-document to the Investment's BC.  Although the development of the BC and the BoE is an iterative process and will be updated multiple times as an investment matures along the project life-cycle, the BoE and BC need to be tightly integrated and aligned at specific reporting milestones. \n\n"]
["The BoE is intended to be shared with project stakeholder's so that everyone understands the key elements that make up the cost of an investment.\n\n"]
["There are five parts to the BoE Template:\n\n1) Rate Table\n    Includes all relevant inflation and financing rates required to complete the various sections of the BoE template.\n\n"]
["2)  BoE Summary Tab\n      Provides key information specific to the investment and how the estimate was assembled.\n      Specific information from this tab can be copied directly into or from the Business Case."]
["3)  BoE Capital Cost Detail Tab\n     Itemized costs to perform all activities to deliver the investment. \n     The concept is to identify costs at the level of detail necessary based on project maturity. \n     These costs are then spread out over the length of the project in order to apply inflationary costs related to construction, interest,\n      etc.\n ** It is important that specific cost groups and cost items not be deleted or left blank but inserted as $0 if the items are not applicable. \n     The intent is that a BoE reviewer can see that the BoE author had considered these cost items but that they are not applicable. \n     Rationale: If the cost items were deleted (entire line),  the reviewer would not be able to determine if the author considered them.\n\n     Note: Capital costs that were originally identified in the Net Present Value (NPV) tool for the selected option should be inserted into the BoE Cost  \n                 Detail  tab and updated as required."]
["4) BoE Operating Cost Detail Tab\n     Operating budget implications as a result of the capital project. This includes incremental Full Time Equivalents (FTEs), operation and  \n     maintenance costs and debt and financing charges.  These costs will be used to populate the operating impact section of the BoE Cost \n     Detail tab as well as the Capital Detail Sheets.\n\n   Note: Operating costs that were originally identified in the Net Present Value (NPV) tool for the selected option should be inserted into the BoE \n              Cost Detail tab and updated as required."]
["5)  Class of Estimate Tab\n      This sheet helps the BoE author to rationalize the Class of Estimate by identifying key deliverables that define a specific \n      Class of Estimate per AACE's recommended practices. Instructions for populating this tab, complete with examples, is available in the Class\n      of Estimate Instructions tab."]
["6) Rationale\nOPTIONAL.  A blank tab is available to allow users to add additional cost detail and/or supporting calculations for the BoE."]
[]
{"$rows_left_out":47}
{"sheet":"Rate Table","index":1,"n_rows":11,"n_cols":13,"rows_kept":11,"cut":false,"hidden":false,"merged":[[0,0,0,12]]}
["                      Rate Table for Basis of Estimate"]
[]
["Rates",2021,{"$f":"B3+1","v":2022},{"$f":"C3+1","v":2023},2024,2025,2026,2027,2028,2029,2030,2031,"Source"]
["Construction/Capital Inflation",0.03,0.03,0.03,0.03,0.03,0.03,0.03,0.03,0.03,0.03,0.03,"Economic Research Office"]
["Operation & Maintenance Inflation",0.02,0.02,0.02,0.02,0.02,0.02,0.02,0.02,0.02,0.02,0.02,"Economic Research Office"]
["Internal Debt Financing ",2.5000000000000001E-2,2.5000000000000001E-2,2.5000000000000001E-2,2.5000000000000001E-2,2.5000000000000001E-2,2.5000000000000001E-2,2.5000000000000001E-2,2.5000000000000001E-2,2.5000000000000001E-2,2.5000000000000001E-2,2.5000000000000001E-2,"Corporate Finance - Treasury Division"]
["Long term Debt Financing (external, 30 year term)",0.03,3.5000000000000003E-2,0.04,4.4999999999999998E-2,0.05,5.5E-2,0.06,0.06,0.06,0.06,0.06,"Corporate Finance - Treasury Division"]
["Corporate Admin",1.2500000000000001E-2,1.2500000000000001E-2,1.2500000000000001E-2,1.2500000000000001E-2,1.2500000000000001E-2,1.2500000000000001E-2,1.2500000000000001E-2,1.2500000000000001E-2,1.2500000000000001E-2,1.2500000000000001E-2,1.2500000000000001E-2,"Financial Planning & Review"]
["Corporate Interest",0.02,0.02,0.02,0.02,0.02,0.02,0.02,0.02,0.02,0.02,0.02,"Financial Planning & Review"]
["Principle Repayment (30 year term)",2.2800000000000001E-2,2.2800000000000001E-2,2.2800000000000001E-2,2.2800000000000001E-2,2.2800000000000001E-2,2.2800000000000001E-2,2.2800000000000001E-2,2.2800000000000001E-2,2.2800000000000001E-2,2.2800000000000001E-2,2.2800000000000001E-2,"Corporate Finance - Treasury Division"]
{"$rows_left_out":2}
{"sheet":"BoE Summary","index":2,"n_rows":37,"n_cols":7,"rows_kept":37,"cut":false,"hidden":false,"merged":[[20,0,20,6],[12,1,12,6],[13,1,13,6],[14,1,14,6],[15,1,15,6],[16,1,16,6],[17,1,17,6],[18,1,18,6],[29,1,29,6],[30,1,30,6],[31,1,31,6],[35,1,35,6],[32,1,32,6],[34,0,34,6],[5,1,5,6],[6,1,6,6],[7,1,7,6],[8,1,8,6],[10,0,10,6],[0,0,0,6],[1,1,1,6],[2,1,2,6],[3,1,3,6],[4,1,4,6],[42,1,42,2],[42,3,42,4],[42,5,42,6],[40,1,40,2],[37,3,37,4],[37,5,37,6],[38,3,38,4],[38,5,38,6],[40,3,40,4],[40,5,40,6],[37,1,37,2],[38,1,38,2],[39,1,39,2],[39,3,39,4],[39,5,39,6],[41,1,41,2],[41,3,41,4],[41,5,41,6],[36,1,36,2],[36,3,36,4],[36,5,36,6]]}
["Basis of Estimate Summary"]
["Investment Title"]
["Investment Description"]
["Department"]
["Date"]
["BoE Author"]
["BoE Estimating Team"]
["BoE Reviewed by "]
["Business Case ID"]
[]
{"$rows_left_out":28}
{"sheet":"BoE Capital Cost Detail","index":3,"n_rows":218,"n_cols":80,"rows_kept":218,"cut":false,"hidden":false,"merged":[[217,0,217,1],[5,8,5,9],[173,0,173,9],[0,0,0,9],[1,1,1,9],[4,8,4,9],[171,7,171,8],[170,0,170,1],[203,0,203,9],[204,0,204,2],[191,0,191,9],[2,1,2,9],[189,0,189,1],[9,11,9,16],[9,3,9,8],[3,1,3,4],[9,0,10,0],[3,8,3,9],[7,0,7,9],[4,4,5,5],[4,1,4,2]]}
["Basis of Estimate Capital Cost Detail"]
["Investment Title",{"$f":"'BoE Summary'!$B$2","v":0}]
["BC ID",{"$f":"'BoE Summary'!B9:G9","v":0}]
[{"$f":"IF(COUNTIF(R13:R181, \"error\"),\"There is an error in % of Project Work Undertaken. Please correct\",\"\")","v":""},{"$f":"IF(C11>YEAR(NOW()),\"You cannot enter a future dated estimate year.  Please correct\")","v":false},null,null,null,null,null,"Estimate Date",{"$f":"'BoE Summary'!$B$5","v":"00:00:00"}]
[null,"Is this a Major Capital project?",null,"No",null,null,null,"In Service Year"]
[null,null,null,null,null,null,null,"Class of Estimate",{"$f":"'Class of Estimate'!I19","v":"Select Class Estimate"}]
[]
["ESTIMATE DETAIL"]
[null,null,"Cost Escalation / Capital Inflation",0.03,0.03,0.03,0.03,0.03,0.03]
[null,null,"Estimate Year","Year Project Work Undertaken",null,null,null,null,null,null,null,"% of Project Work Undertaken",null,null,null,null,null,"Check",null,null,null,null,null,null,null,null,null,null,null,null,null,null,null,null,null,null,null,null,null,null,null,null,null,null,null,null,null,null,null,null,null,null,null,null,null,null,null,null,null,null,null,null,null,null,null,null,null,null,null,null,null,null,null,null,null,null,null,null,null,"Yes"]
{"$rows_left_out":209}
{"sheet":"BoE Operating Cost Detail","index":4,"n_rows":59,"n_cols":9,"rows_kept":59,"cut":false,"hidden":false,"merged":[[1,1,1,8],[4,0,4,7],[5,2,5,7],[0,0,0,8],[3,1,3,3],[2,1,2,8],[52,1,53,1],[7,1,12,1],[15,0,15,8],[13,0,13,8],[16,0,16,8],[48,0,48,8],[17,0,17,8],[45,1,46,1],[29,1,30,1]]}
["Basis of Estimate Operating Cost Detail"]
["Investment ",{"$f":"'BoE Summary'!$B$2","v":0}]
["BC ID",{"$f":"'BoE Summary'!B9:G9","v":0}]
[null,{"$f":"IF(B7>YEAR(NOW()),\"You cannot enter a future dated estimate year.  Please correct\", \"\")","v":""}]
["Operating Budget Impact Detail Table"]
[null,"Estimate Year","Year  of Operating Impact"]
["NET OPERATING IMPACT ($000's)",2019,2020,{"$f":"C7+1","v":2021},{"$f":"D7+1","v":2022},2023,2024,2025]
["Operating Costs",null,{"$f":"SUM(C47,C31)","v":0},0,0,0,0,0]
["Debt & Finance Charges",null,{"$f":"C54","v":0},{"$f":"D54","v":0},0,0,0,0]
["Total Direct Costs",null,{"$f":"SUM(C8:C9)","v":0},0,0,0,0,0]
{"$rows_left_out":50}
{"sheet":"Class of Estimate Instructions","index":5,"n_rows":31,"n_cols":2,"rows_kept":31,"cut":false,"hidden":false,"merged":[[6,1,6,2],[0,1,0,2],[2,1,2,2],[3,1,3,2],[4,1,4,2],[5,1,5,2],[30,1,30,2],[7,1,7,2],[8,1,8,2],[9,1,9,2],[10,1,10,2]]}
[null,"Class of Estimate Instructions"]
[]
[null,"Class of Estimate Tab"]
[null,"Reference:  The City has customized the Class of Estimate tab based on AACE International Recommended Practice(s):\n        AACE 18R-97 Recommended Practice Cost Estimate Classification System – as applied in engineering, procurement, and construction for the Process Industries   (rev. march 2019)\n       AACE 56R-08 Recommended Practice Cost Estimate Classification System – as applied in engineering, procurement, and construction for the Building and General Construction Industries   (rev. March 2019)\n       AACE 98R-18 Recommended Practice Cost Estimate Classification System – as applied in engineering, procurement, and construction for the Road and Rail Transportation Infrastructure Industries   (rev. March 2019)\n       AACE 97R-18 Recommended Practice Cost Estimate Classification System – as applied in Pipeline Transportation Infrastructure Projects (rev. August 2019) \n\nReprinted with the permission of AACE International, 1265 Suncrest Towne Centre Dr., Morgantown, WV 26505 USA. Phone 304-296-8444. Internet: http://web.aacei.org E-mail: info@aacei.org Copyright © 2019 by AACE International; all rights reserved."]
[null,"Purpose:  As a project progresses through the various industry work streams from Concept through to Construction, project definition, design deliverables and cost estimates will evolve and become more accurate, advancing Cost Estimates from a Class 5 to a Class 1.\n\nIn order to monitor this progression, the Class of Estimate tab is used to track project deliverables against project cost accuracy and percentage of project definition to align with the class of estimate rationale outlined in Table 1 – Classification of Estimate and Table 2 - Estimate Input Checklist and Maturity Matrix."]
[null,"General Instructions \n\nThe BoE Author is responsible for generating the required class estimate by:\n \n1) Select the appropriate investment industry type from the dropdown list which auto-populates the specific general project data deliverables and design deliverables that apply to that type of project.  If the deliverables in the General Project Data or Design Deliverables sections of Table 2 are not applicable to this project, fill in the ‘n/a’ cell in green to indicate such.\n\n2) For the deliverables that do apply, identify the maturity level of the deliverables in the General Project Data and Design Deliverables sections in Table 2, by filling in the best suited maturity level of the deliverables’ current status in green. Determining the maturity level of a deliverable is assessed by the BoE Author or an assigned Subject Matter Expert.\n\n3) When evaluating the class of estimate for a project, all cells must be shaded within the specific class estimate column, to be considered at that level of the cost class estimate. (Refer to example #1)"]
[null,"4) As a cost estimate matures and becomes more accurate, cells shall only be shaded up to and including the level to which the BoE Author is presenting the required class estimate. (Refer to example #3)\n\nNote: Even if the BoE Author believes that a deliverable is ’Complete’ and will remain unchanged as the estimate progresses from Class 3 to Class 1, no ‘Complete’ cells shall be shaded in the Class 2 or Class 1 columns until the project definition continues to progress and the estimate matures into a Class 2 or Class 1 level. This helps ensure that, although a particular deliverable may be completed, a verification of that deliverable is performed at every subsequent Class Estimate to confirm alignment with the project scope."]
[null,"5) Add relevant details in the comments column that support the rationale for selecting maturity level for deliverables. Also  indicate the location of a specific document or drawing related to the deliverable, in order to validate maturity level."]
[null,"Assess the Overall Class Estimate\n\nWhen each deliverable item has been analyzed and classified, the highlighted selections will help to visually determine the Class in which the Basis of Estimate is currently at. \n\nSelect the appropriate Class from the Select Class Estimate cell's drop-down menu."]
[null,"Examples"]
{"$rows_left_out":22}
{"sheet":"Class of Estimate","index":6,"n_rows":253,"n_cols":9,"rows_kept":253,"cut":false,"hidden":false,"merged":[[28,2,28,8],[29,2,29,8],[5,1,5,2],[6,1,6,2],[7,1,7,2],[8,1,8,2],[12,1,12,2],[13,1,13,7],[15,0,15,8],[16,0,16,8],[22,2,22,8],[21,2,21,8],[24,2,24,8],[32,2,32,8],[0,0,0,8],[18,1,18,2],[18,3,18,7],[30,2,30,8],[31,2,31,8],[1,2,1,4],[2,0,2,1],[2,2,2,4],[11,1,11,2],[9,1,9,2],[4,0,4,8],[2,6,2,8],[1,6,1,8],[25,2,25,8],[26,2,26,8]]}
["Class of Estimate"]
["Investment Title",null,{"$f":"'BoE Summary'!B2","v":0},null,null,"Estimate Date",{"$f":"'BoE Summary'!B5","v":"00:00:00"}]
["Description",null,{"$f":"'BoE Summary'!B3","v":0},null,null," Business Case ID ",{"$f":"'BoE Summary'!B9","v":0}]
[]
["Table 1 - Classification of Estimate 1"]
[null,"Characteristic",null,"Class 5","Class 4","Class 3","Class 2","Class 1"]
[1,"Project Definition/Design % Complete ",null,"~1%*","~10%*","~30%*","~60%*","~99%*"]
[{"$f":"A7+1","v":2},"End Usage - typical purpose of estimate",null,"Concept","Feasibility ","Budget Authorization"," Detailed  Design*","Tender Documents*"]
[{"$f":"A8+1","v":3},"Methodology - typical estimating method",null,"parametric models, judgment, or analogy ","parametric models, assembly driven models ","semi-detailed unit costs with assembly level line items","detailed unit cost with forced detailed \ntake-off","detailed unit cost with forced detailed \ntake-off"]
[null,"Buildings and General Construction:",null,"SF or m2 factoring"]
{"$rows_left_out":244}
{"sheet":"Data","index":7,"n_rows":21,"n_cols":12,"rows_kept":21,"cut":false,"hidden":true,"merged":[]}
[]
[]
[]
[]
[null,null,null,null,1,2,3,4,5,null,null,"Departments"]
[null,null,null,null,6,7,8,9,10]
[null,null,null,null,null,null,null,null,null,null,null,"Community Services"]
[null,1,null,null,null,null,null,null,null,null,null,"Fire Paramedic Services"]
[null,2,null,null,null,null,null,null,null,null,null,"Fleet"]
[null,3,null,null,null,null,null,null,null,null,null,"Innovation"]
{"$rows_left_out":12}
{"sheet":"Rationale","index":8,"n_rows":0,"n_cols":0,"rows_kept":0,"cut":false,"hidden":false,"merged":[]}

{"sheet":"Master Data","index":9,"n_rows":564,"n_cols":14,"rows_kept":564,"cut":false,"hidden":true,"merged":[]}
[null,null,"old",null,null,null,null,null,null,null,null,"enter row# with rows formula"]
[null,null,null,null,null,null,null,null,null,null,null,null,"if at first test condition that this selected country is equal to this country then give me this row # in col helper1"]
[null,null,null,null,null,null,null,null,null,null,null,null,"Only returns row # that match the selection"]
[]
["Project Type",null,"Deliverable","Class5","Class 4","Class 3","Class 2","Class 1","N/A","Comments:",null,"helper 1","helper 2","helper 3"]
["ProcessIndustry",1,"test "]
["Process Industry","-","Key Deliverable Target Status:","- Block flow diagram agreed by stakeholders. \n- List of key design basis assumptions.","- Process flow diagrams (PFD's) issued for design.","- Piping and instrumentation diagrams (P&IDs) issued for design.","- All specifications and datasheets complete including for instrumentation.","- All deliverables in the maturity matrix complete.","Shade 'n/a' cell green if specific deliverable is not applicable to project. ","Add relevant details to support the rationale for selecting the deliverable maturity level. Also indicate the location of specific document or drawing related to the deliverable, in order to validate maturity level.",null,{"$f":"ROWS(A$7:$A7)","v":1},{"$f":"IF('Class of Estimate'!$B$19='Master Data'!A7,'Master Data'!L7,\"\" )","v":""},{"$f":"IFERROR(SMALL($M$7:$M$567,ROWS($A7:A$7)),\"\" )","v":""}]
["Process Industry","-","General Project Data Deliverables:"," "," "," "," "," "," "," ",null,{"$f":"ROWS(A$7:$A8)","v":2},{"$f":"IF('Class of Estimate'!$B$19='Master Data'!A8,'Master Data'!L8,\"\" )","v":""},{"$f":"IFERROR(SMALL($M$7:$M$567,ROWS($A$7:A8)),\"\" )","v":""}]
["Process Industry",1,"Project Scope Description","Preliminary","Preliminary","Defined","Defined","Defined","n/a"," ",null,{"$f":"ROWS(A$7:$A9)","v":3},{"$f":"IF('Class of Estimate'!$B$19='Master Data'!A9,'Master Data'!L9,\"\" )","v":""},{"$f":"IFERROR(SMALL($M$7:$M$567,ROWS($A$7:A9)),\"\" )","v":""}]
["Process Industry",2,"Plant Production/Facility Capacity","Preliminary","Preliminary","Defined","Defined","Defined","n/a"," ",null,{"$f":"ROWS(A$7:$A10)","v":4},{"$f":"IF('Class of Estimate'!$B$19='Master Data'!A10,'Master Data'!L10,\"\" )","v":""},{"$f":"IFERROR(SMALL($M$7:$M$567,ROWS($A$7:A10)),\"\" )","v":""}]
{"$rows_left_out":555}
{"sheet":"MD OLD","index":10,"n_rows":22,"n_cols":7,"rows_kept":22,"cut":false,"hidden":true,"merged":[]}
[null,"Project Type"]
[null,"Select Investment Industry Type",null,null,null,null,"1 - Not Required"]
[null,"Building & General Construction","Based on AACE 56R-08 Recommended Practice Cost Estimate Classification System – as applied in engineering, procurement, and construction for the Building and General Construction Industries (rev. March 2019)   \n\nReprinted with the permission of AACE International, 1265 Suncrest Towne Centre Dr., Morgantown, WV 26505 USA. Phone 304-296-8444. Internet: http://web.aacei.org E-mail: info@aacei.org Copyright © 2019 by AACE International; all rights reserved.",null,null,null,"2 - Preliminary"]
[null,"Information Technology"," * Custom City Developed Cost Estimate Classification System for Information Technology type projects, as AACE does not currently have a cost estimate classification for IT type projects. (rel. January 2020)",null,null,null,"3 - Defined"]
[null,"Pipeline Industry","Based on AACE 97R-18 Recommended Practice Cost Estimate Classification System – as applied in Pipeline Transportation Infrastructure Projects (rev. August 2019)  \n\nReprinted with the permission of AACE International, 1265 Suncrest Towne Centre Dr., Morgantown, WV 26505 USA. Phone 304-296-8444. Internet: http://web.aacei.org E-mail: info@aacei.org Copyright © 2019 by AACE International; all rights reserved.",null,null,null,"4 - Not Applicable"]
[null,"Process Industry","Based on AACE 18R-97 Recommended Practice Cost Estimate Classification System – as applied in engineering, procurement, and construction for the Process Industries  (rev. March 2019)  \n\nReprinted with the permission of AACE International, 1265 Suncrest Towne Centre Dr., Morgantown, WV 26505 USA. Phone 304-296-8444. Internet: http://web.aacei.org E-mail: info@aacei.org Copyright © 2019 by AACE International; all rights reserved."]
[null,"Transportation Infrastructure","Based on AACE 98R-18 Recommended Practice Cost Estimate Classification System – as applied in engineering, procurement, and construction for the Road and Rail Transportation Infrastructure Industries  (rev. March 2019)  \n\nReprinted with the permission of AACE International, 1265 Suncrest Towne Centre Dr., Morgantown, WV 26505 USA. Phone 304-296-8444. Internet: http://web.aacei.org E-mail: info@aacei.org Copyright © 2019 by AACE International; all rights reserved. "]
[]
[]
[]
{"$rows_left_out":12}